Information card for entry 7034560
Formula | C18 H20 Cl4 N4 Zn2 |
Calculated formula | C18 H20 Cl4 N4 Zn2 |
SMILES | [Zn]1([n]2ccccc2C=[N]1[C@@H]1CCCC[C@H]1[N]1[Zn]([n]2c(C=1)cccc2)(Cl)Cl)(Cl)Cl.[Zn]1([n]2ccccc2C=[N]1[C@H]1CCCC[C@@H]1[N]1[Zn]([n]2c(C=1)cccc2)(Cl)Cl)(Cl)Cl |
Title of publication | Facile luminescent tuning of Zn(II)/Hg(II) complexes based on flexible, semi-rigid and rigid polydentate Schiff bases from blue to green to red: structural, photophysics, electrochemistry and theoretical calculations studies. |
Authors of publication | Wang, Xin-Ming; Chen, Shuo; Fan, Rui-Qing; Zhang, Fu-Qiang; Yang, Yu-Lin |
Journal of publication | Dalton transactions (Cambridge, England : 2003) |
Year of publication | 2015 |
Journal volume | 44 |
Journal issue | 17 |
Pages of publication | 8107 - 8125 |
a | 8.336 ± 0.0017 Å |
b | 12.047 ± 0.002 Å |
c | 13.642 ± 0.003 Å |
α | 112.4 ± 0.03° |
β | 90.1 ± 0.03° |
γ | 110.13 ± 0.03° |
Cell volume | 1175.2 ± 0.6 Å3 |
Cell temperature | 293 ± 2 K |
Ambient diffraction temperature | 293 ± 2 K |
Number of distinct elements | 5 |
Space group number | 2 |
Hermann-Mauguin space group symbol | P -1 |
Hall space group symbol | -P 1 |
Residual factor for all reflections | 0.191 |
Residual factor for significantly intense reflections | 0.088 |
Weighted residual factors for significantly intense reflections | 0.2243 |
Weighted residual factors for all reflections included in the refinement | 0.3098 |
Goodness-of-fit parameter for all reflections included in the refinement | 0.723 |
Diffraction radiation wavelength | 0.71073 Å |
Diffraction radiation type | MoKα |