Information card for entry 7034561
Formula | C20 H24 Cl4 N4 O2 Zn2 |
Calculated formula | C20 H24 Cl4 N4 O2 Zn2 |
SMILES | C1c2cccc([n]2[Zn]([N]=1[C@@H]1CCCC[C@H]1[N]1=Cc2cccc([n]2[Zn]1(Cl)Cl)OC)(Cl)Cl)OC |
Title of publication | Facile luminescent tuning of Zn(II)/Hg(II) complexes based on flexible, semi-rigid and rigid polydentate Schiff bases from blue to green to red: structural, photophysics, electrochemistry and theoretical calculations studies. |
Authors of publication | Wang, Xin-Ming; Chen, Shuo; Fan, Rui-Qing; Zhang, Fu-Qiang; Yang, Yu-Lin |
Journal of publication | Dalton transactions (Cambridge, England : 2003) |
Year of publication | 2015 |
Journal volume | 44 |
Journal issue | 17 |
Pages of publication | 8107 - 8125 |
a | 23.119 ± 0.005 Å |
b | 8.2756 ± 0.0017 Å |
c | 13.429 ± 0.003 Å |
α | 90° |
β | 90.56 ± 0.03° |
γ | 90° |
Cell volume | 2569.2 ± 1 Å3 |
Cell temperature | 293 ± 2 K |
Ambient diffraction temperature | 293 ± 2 K |
Number of distinct elements | 6 |
Space group number | 15 |
Hermann-Mauguin space group symbol | C 1 2/c 1 |
Hall space group symbol | -C 2yc |
Residual factor for all reflections | 0.0381 |
Residual factor for significantly intense reflections | 0.0301 |
Weighted residual factors for significantly intense reflections | 0.0727 |
Weighted residual factors for all reflections included in the refinement | 0.0768 |
Goodness-of-fit parameter for all reflections included in the refinement | 0.976 |
Diffraction radiation wavelength | 0.71073 Å |
Diffraction radiation type | MoKα |