Information card for entry 7034582
Formula | C31.5 H28 O P Ti |
Calculated formula | C31.5 H28 O P Ti |
Title of publication | Titanocene(iii) complexes with 2-phosphinoaryloxide ligands for the catalytic dehydrogenation of dimethylamine borane. |
Authors of publication | Klahn, Marcus; Hollmann, Dirk; Spannenberg, Anke; Brückner, Angelika; Beweries, Torsten |
Journal of publication | Dalton transactions (Cambridge, England : 2003) |
Year of publication | 2015 |
Journal volume | 44 |
Journal issue | 27 |
Pages of publication | 12103 - 12111 |
a | 8.9793 ± 0.0002 Å |
b | 9.9618 ± 0.0002 Å |
c | 15.3438 ± 0.0004 Å |
α | 100.246 ± 0.001° |
β | 94.705 ± 0.001° |
γ | 112.776 ± 0.001° |
Cell volume | 1227.96 ± 0.05 Å3 |
Cell temperature | 150 ± 2 K |
Ambient diffraction temperature | 150 ± 2 K |
Number of distinct elements | 5 |
Space group number | 2 |
Hermann-Mauguin space group symbol | P -1 |
Hall space group symbol | -P 1 |
Residual factor for all reflections | 0.0413 |
Residual factor for significantly intense reflections | 0.035 |
Weighted residual factors for significantly intense reflections | 0.0859 |
Weighted residual factors for all reflections included in the refinement | 0.092 |
Goodness-of-fit parameter for all reflections included in the refinement | 1.061 |
Diffraction radiation wavelength | 0.71073 Å |
Diffraction radiation type | MoKα |