Information card for entry 7034583
Formula | C50 H61 F3 N6 O6 Pt S |
Calculated formula | C50 H61 F3 N6 O6 Pt S |
Title of publication | Synthesis, characterization, photophysics, and anion binding properties of platinum(ii) acetylide complexes with urea group. |
Authors of publication | Zhang, Zhi-Hui; Liu, Jiewei; Wan, Li-Qi; Jiang, Fang-Ru; Lam, Chi-Keung; Ye, Bao-Hui; Qiao, Zhengping; Chao, Hsiu-Yi |
Journal of publication | Dalton transactions (Cambridge, England : 2003) |
Year of publication | 2015 |
Journal volume | 44 |
Journal issue | 17 |
Pages of publication | 7785 - 7796 |
a | 12.1155 ± 0.0003 Å |
b | 29.9363 ± 0.0005 Å |
c | 15.1278 ± 0.0004 Å |
α | 90° |
β | 112.253 ± 0.003° |
γ | 90° |
Cell volume | 5078.1 ± 0.2 Å3 |
Cell temperature | 298 ± 2 K |
Ambient diffraction temperature | 298 ± 2 K |
Number of distinct elements | 7 |
Space group number | 14 |
Hermann-Mauguin space group symbol | P 1 21/n 1 |
Hall space group symbol | -P 2yn |
Residual factor for all reflections | 0.0581 |
Residual factor for significantly intense reflections | 0.0545 |
Weighted residual factors for significantly intense reflections | 0.139 |
Weighted residual factors for all reflections included in the refinement | 0.1451 |
Goodness-of-fit parameter for all reflections included in the refinement | 1.047 |
Diffraction radiation wavelength | 0.71 Å |
Diffraction radiation type | MoKα |