Information card for entry 7034584
Chemical name | 3cMeCN |
Formula | C46 H48 F6 N6 O4 Pt S |
Calculated formula | C46 H48 F6 N6 O4 Pt S |
SMILES | [Pt]12(C#Cc3ccc(NC(=O)Nc4ccc(cc4)C(F)(F)F)cc3)[n]3ccc(cc3c3cc(cc([n]13)c1cc(cc[n]21)C(C)(C)C)C(C)(C)C)C(C)(C)C.S(=O)(=O)([O-])C(F)(F)F.N#CC |
Title of publication | Synthesis, characterization, photophysics, and anion binding properties of platinum(ii) acetylide complexes with urea group. |
Authors of publication | Zhang, Zhi-Hui; Liu, Jiewei; Wan, Li-Qi; Jiang, Fang-Ru; Lam, Chi-Keung; Ye, Bao-Hui; Qiao, Zhengping; Chao, Hsiu-Yi |
Journal of publication | Dalton transactions (Cambridge, England : 2003) |
Year of publication | 2015 |
Journal volume | 44 |
Journal issue | 17 |
Pages of publication | 7785 - 7796 |
a | 14.39499 ± 0.00012 Å |
b | 14.86572 ± 0.00015 Å |
c | 21.4413 ± 0.0002 Å |
α | 90° |
β | 95.4312 ± 0.0008° |
γ | 90° |
Cell volume | 4567.67 ± 0.07 Å3 |
Cell temperature | 173 ± 2 K |
Ambient diffraction temperature | 173 ± 2 K |
Number of distinct elements | 7 |
Space group number | 14 |
Hermann-Mauguin space group symbol | P 1 21/n 1 |
Hall space group symbol | -P 2yn |
Residual factor for all reflections | 0.0443 |
Residual factor for significantly intense reflections | 0.0385 |
Weighted residual factors for significantly intense reflections | 0.0964 |
Weighted residual factors for all reflections included in the refinement | 0.1019 |
Goodness-of-fit parameter for all reflections included in the refinement | 1.015 |
Diffraction radiation wavelength | 1.54178 Å |
Diffraction radiation type | CuKα |