Information card for entry 7034592
Formula | C16 H23 Au B Cl N4 O2 |
Calculated formula | C16 H23 Au B Cl N4 O2 |
SMILES | C1(N(C=CN1c1ncccn1)CCCB1OC(C(C)(C)O1)(C)C)=[Au]Cl |
Title of publication | Synthesis and structure of Ag(i), Pd(ii), Rh(i), Ru(ii) and Au(i) NHC-complexes with a pendant Lewis acidic boronic ester moiety. |
Authors of publication | Toure, Momar; Chuzel, Olivier; Parrain, Jean-Luc |
Journal of publication | Dalton transactions (Cambridge, England : 2003) |
Year of publication | 2015 |
Journal volume | 44 |
Journal issue | 16 |
Pages of publication | 7139 - 7143 |
a | 24.2473 ± 0.0007 Å |
b | 8.6331 ± 0.0003 Å |
c | 9.8278 ± 0.0004 Å |
α | 90° |
β | 100.011 ± 0.001° |
γ | 90° |
Cell volume | 2025.92 ± 0.12 Å3 |
Cell temperature | 293 ± 2 K |
Ambient diffraction temperature | 293 ± 2 K |
Number of distinct elements | 7 |
Space group number | 5 |
Hermann-Mauguin space group symbol | C 1 2 1 |
Hall space group symbol | C 2y |
Residual factor for all reflections | 0.0642 |
Residual factor for significantly intense reflections | 0.0562 |
Weighted residual factors for significantly intense reflections | 0.1395 |
Weighted residual factors for all reflections included in the refinement | 0.1474 |
Goodness-of-fit parameter for all reflections included in the refinement | 1.076 |
Diffraction radiation probe | x-ray |
Diffraction radiation wavelength | 0.71073 Å |
Diffraction radiation type | MoKα |