Information card for entry 7034593
Chemical name | Ruthenium pyranylidene |
Formula | C58 H57 B O7 P2 Ru |
Calculated formula | C58 H57 B O7 P2 Ru |
Title of publication | Preparation of pyranylidene complexes of ruthenium. |
Authors of publication | Albertin, Gabriele; Antoniutti, Stefano; Bortoluzzi, Marco; Botter, Alessandra; Castro, Jesús |
Journal of publication | Dalton transactions (Cambridge, England : 2003) |
Year of publication | 2015 |
Journal volume | 44 |
Journal issue | 16 |
Pages of publication | 7411 - 7418 |
a | 10.9219 ± 0.0008 Å |
b | 14.7181 ± 0.0011 Å |
c | 16.2149 ± 0.0012 Å |
α | 81.41 ± 0.004° |
β | 87.13 ± 0.004° |
γ | 87.354 ± 0.003° |
Cell volume | 2572.1 ± 0.3 Å3 |
Cell temperature | 296 ± 2 K |
Ambient diffraction temperature | 296 ± 2 K |
Number of distinct elements | 6 |
Space group number | 2 |
Hermann-Mauguin space group symbol | P -1 |
Hall space group symbol | -P 1 |
Residual factor for all reflections | 0.0577 |
Residual factor for significantly intense reflections | 0.0497 |
Weighted residual factors for significantly intense reflections | 0.1305 |
Weighted residual factors for all reflections included in the refinement | 0.1399 |
Goodness-of-fit parameter for all reflections included in the refinement | 1.034 |
Diffraction radiation wavelength | 1.54178 Å |
Diffraction radiation type | CuKα |