Information card for entry 7034611
Formula | C12 H18 Ag N7 O9 |
Calculated formula | C12 H18 Ag N7 O9 |
Title of publication | Synthesis, characterization and antimicrobial activity of water-soluble silver(i) complexes of metronidazole drug and selected counter-ions. |
Authors of publication | Kalinowska-Lis, Urszula; Felczak, Aleksandra; Chęcińska, Lilianna; Zawadzka, Katarzyna; Patyna, Emilia; Lisowska, Katarzyna; Ochocki, Justyn |
Journal of publication | Dalton transactions (Cambridge, England : 2003) |
Year of publication | 2015 |
Journal volume | 44 |
Journal issue | 17 |
Pages of publication | 8178 - 8189 |
a | 6.6943 ± 0.0001 Å |
b | 11.685 ± 0.0002 Å |
c | 12.902 ± 0.0003 Å |
α | 63.716 ± 0.002° |
β | 88.784 ± 0.001° |
γ | 87.443 ± 0.001° |
Cell volume | 903.99 ± 0.03 Å3 |
Cell temperature | 100 ± 2 K |
Ambient diffraction temperature | 100 ± 2 K |
Number of distinct elements | 5 |
Space group number | 2 |
Hermann-Mauguin space group symbol | P -1 |
Hall space group symbol | -P 1 |
Residual factor for all reflections | 0.017 |
Residual factor for significantly intense reflections | 0.0168 |
Weighted residual factors for significantly intense reflections | 0.0446 |
Weighted residual factors for all reflections included in the refinement | 0.0448 |
Goodness-of-fit parameter for all reflections included in the refinement | 1.087 |
Diffraction radiation wavelength | 0.71073 Å |
Diffraction radiation type | MoKα |