Information card for entry 7034612
Formula | C12 H18 Ag Cl N6 O10 |
Calculated formula | C12 H18 Ag Cl N6 O10 |
SMILES | [Ag]([n]1cc(n(c1C)CCO)N(=O)=O)[n]1cc(n(c1C)CCO)N(=O)=O.Cl(=O)(=O)(=O)[O-] |
Title of publication | Synthesis, characterization and antimicrobial activity of water-soluble silver(i) complexes of metronidazole drug and selected counter-ions. |
Authors of publication | Kalinowska-Lis, Urszula; Felczak, Aleksandra; Chęcińska, Lilianna; Zawadzka, Katarzyna; Patyna, Emilia; Lisowska, Katarzyna; Ochocki, Justyn |
Journal of publication | Dalton transactions (Cambridge, England : 2003) |
Year of publication | 2015 |
Journal volume | 44 |
Journal issue | 17 |
Pages of publication | 8178 - 8189 |
a | 7.3542 ± 0.00001 Å |
b | 9.5694 ± 0.0002 Å |
c | 27.1612 ± 0.0004 Å |
α | 90° |
β | 90.151 ± 0.001° |
γ | 90° |
Cell volume | 1911.47 ± 0.05 Å3 |
Cell temperature | 100 ± 2 K |
Ambient diffraction temperature | 100 ± 2 K |
Number of distinct elements | 6 |
Space group number | 14 |
Hermann-Mauguin space group symbol | P 1 21/c 1 |
Hall space group symbol | -P 2ybc |
Residual factor for all reflections | 0.0231 |
Residual factor for significantly intense reflections | 0.0215 |
Weighted residual factors for significantly intense reflections | 0.0512 |
Weighted residual factors for all reflections included in the refinement | 0.0521 |
Goodness-of-fit parameter for all reflections included in the refinement | 1.041 |
Diffraction radiation wavelength | 0.71073 Å |
Diffraction radiation type | MoKα |