Information card for entry 7034615
Formula | C26 H42 Ag2 N12 O18 S2 |
Calculated formula | C26 H42 Ag2 N12 O18 S2 |
Title of publication | Synthesis, characterization and antimicrobial activity of water-soluble silver(i) complexes of metronidazole drug and selected counter-ions. |
Authors of publication | Kalinowska-Lis, Urszula; Felczak, Aleksandra; Chęcińska, Lilianna; Zawadzka, Katarzyna; Patyna, Emilia; Lisowska, Katarzyna; Ochocki, Justyn |
Journal of publication | Dalton transactions (Cambridge, England : 2003) |
Year of publication | 2015 |
Journal volume | 44 |
Journal issue | 17 |
Pages of publication | 8178 - 8189 |
a | 7.4078 ± 0.0004 Å |
b | 10.0158 ± 0.0006 Å |
c | 27.2729 ± 0.0009 Å |
α | 90° |
β | 91.266 ± 0.005° |
γ | 90° |
Cell volume | 2023.02 ± 0.18 Å3 |
Cell temperature | 293 ± 2 K |
Ambient diffraction temperature | 293 ± 2 K |
Number of distinct elements | 6 |
Space group number | 14 |
Hermann-Mauguin space group symbol | P 1 21/c 1 |
Hall space group symbol | -P 2ybc |
Residual factor for all reflections | 0.052 |
Residual factor for significantly intense reflections | 0.0395 |
Weighted residual factors for significantly intense reflections | 0.0905 |
Weighted residual factors for all reflections included in the refinement | 0.1008 |
Goodness-of-fit parameter for all reflections included in the refinement | 1.082 |
Diffraction radiation wavelength | 0.71073 Å |
Diffraction radiation type | MoKα |