Information card for entry 7034614
Formula | C24 H36 Ag2 B2 F8 N12 O12 |
Calculated formula | C24 H36 Ag2 B2 F8 N12 O12 |
Title of publication | Synthesis, characterization and antimicrobial activity of water-soluble silver(i) complexes of metronidazole drug and selected counter-ions. |
Authors of publication | Kalinowska-Lis, Urszula; Felczak, Aleksandra; Chęcińska, Lilianna; Zawadzka, Katarzyna; Patyna, Emilia; Lisowska, Katarzyna; Ochocki, Justyn |
Journal of publication | Dalton transactions (Cambridge, England : 2003) |
Year of publication | 2015 |
Journal volume | 44 |
Journal issue | 17 |
Pages of publication | 8178 - 8189 |
a | 12.4446 ± 0.0001 Å |
b | 9.3099 ± 0.0001 Å |
c | 19.9718 ± 0.0002 Å |
α | 90° |
β | 123.399 ± 0.001° |
γ | 90° |
Cell volume | 1931.77 ± 0.04 Å3 |
Cell temperature | 100 ± 2 K |
Ambient diffraction temperature | 100 ± 2 K |
Number of distinct elements | 7 |
Space group number | 14 |
Hermann-Mauguin space group symbol | P 1 21/c 1 |
Hall space group symbol | -P 2ybc |
Residual factor for all reflections | 0.019 |
Residual factor for significantly intense reflections | 0.0183 |
Weighted residual factors for significantly intense reflections | 0.0481 |
Weighted residual factors for all reflections included in the refinement | 0.0489 |
Goodness-of-fit parameter for all reflections included in the refinement | 1.101 |
Diffraction radiation wavelength | 0.71073 Å |
Diffraction radiation type | MoKα |