Information card for entry 7034624
Formula | C36 H43 Co3 N7 O16 |
Calculated formula | C35.88 H42.9 Co3 N6.98 O16 |
Title of publication | Synthesis and characterization of three amino-functionalized metal-organic frameworks based on the 2-aminoterephthalic ligand. |
Authors of publication | Yang, Ying; Lin, Rijia; Ge, Lei; Hou, Lei; Bernhardt, Paul; Rufford, Thomas E.; Wang, Shaobin; Rudolph, Victor; Wang, Yaoyu; Zhu, Zhonghua |
Journal of publication | Dalton transactions (Cambridge, England : 2003) |
Year of publication | 2015 |
Journal volume | 44 |
Journal issue | 17 |
Pages of publication | 8190 - 8197 |
a | 18.1534 ± 0.0012 Å |
b | 25.494 ± 0.002 Å |
c | 9.7663 ± 0.0008 Å |
α | 90° |
β | 90° |
γ | 90° |
Cell volume | 4519.9 ± 0.6 Å3 |
Cell temperature | 190 ± 2 K |
Ambient diffraction temperature | 190 ± 2 K |
Number of distinct elements | 5 |
Space group number | 61 |
Hermann-Mauguin space group symbol | P b c a |
Hall space group symbol | -P 2ac 2ab |
Residual factor for all reflections | 0.1372 |
Residual factor for significantly intense reflections | 0.098 |
Weighted residual factors for significantly intense reflections | 0.2352 |
Weighted residual factors for all reflections included in the refinement | 0.2626 |
Goodness-of-fit parameter for all reflections included in the refinement | 1.118 |
Diffraction radiation probe | x-ray |
Diffraction radiation wavelength | 1.54184 Å |
Diffraction radiation type | CuKα |