Information card for entry 7034625
Formula | C11 H12 N2 O5 Sr |
Calculated formula | C11 H12 N2 O5 Sr |
Title of publication | Synthesis and characterization of three amino-functionalized metal-organic frameworks based on the 2-aminoterephthalic ligand. |
Authors of publication | Yang, Ying; Lin, Rijia; Ge, Lei; Hou, Lei; Bernhardt, Paul; Rufford, Thomas E.; Wang, Shaobin; Rudolph, Victor; Wang, Yaoyu; Zhu, Zhonghua |
Journal of publication | Dalton transactions (Cambridge, England : 2003) |
Year of publication | 2015 |
Journal volume | 44 |
Journal issue | 17 |
Pages of publication | 8190 - 8197 |
a | 18.2674 ± 0.0012 Å |
b | 7.3169 ± 0.0003 Å |
c | 9.9574 ± 0.0006 Å |
α | 90° |
β | 90° |
γ | 90° |
Cell volume | 1330.91 ± 0.13 Å3 |
Cell temperature | 293 ± 2 K |
Ambient diffraction temperature | 293 ± 2 K |
Number of distinct elements | 5 |
Space group number | 62 |
Hermann-Mauguin space group symbol | P m n b |
Hall space group symbol | -P 2bc 2a |
Residual factor for all reflections | 0.0831 |
Residual factor for significantly intense reflections | 0.0703 |
Weighted residual factors for significantly intense reflections | 0.147 |
Weighted residual factors for all reflections included in the refinement | 0.1519 |
Goodness-of-fit parameter for all reflections included in the refinement | 1.227 |
Diffraction radiation probe | x-ray |
Diffraction radiation wavelength | 0.71073 Å |
Diffraction radiation type | MoKα |