Information card for entry 7034647
Formula | C39 H56 Cl3 Co2 N10 O13 |
Calculated formula | C39 H56 Cl3 Co2 N10 O13 |
Title of publication | Inducing magnetic communication in caged dinuclear Co(ii) systems. |
Authors of publication | Caballero-Jiménez, Judith; Habib, Fatemah; Ramírez-Rosales, Daniel; Grande-Aztatzi, Rafael; Merino, Gabriel; Korobkov, Ilia; Singh, Mukesh Kumar; Rajaraman, Gopalan; Reyes-Ortega, Yasmi; Murugesu, Muralee |
Journal of publication | Dalton transactions (Cambridge, England : 2003) |
Year of publication | 2015 |
Journal volume | 44 |
Journal issue | 18 |
Pages of publication | 8649 - 8659 |
a | 39.4302 ± 0.0015 Å |
b | 9.1554 ± 0.0004 Å |
c | 30.0283 ± 0.0012 Å |
α | 90° |
β | 115.497 ± 0.002° |
γ | 90° |
Cell volume | 9784.4 ± 0.7 Å3 |
Cell temperature | 200 ± 2 K |
Ambient diffraction temperature | 200 ± 2 K |
Number of distinct elements | 6 |
Space group number | 15 |
Hermann-Mauguin space group symbol | C 1 2/c 1 |
Hall space group symbol | -C 2yc |
Residual factor for all reflections | 0.1241 |
Residual factor for significantly intense reflections | 0.0788 |
Weighted residual factors for significantly intense reflections | 0.1864 |
Weighted residual factors for all reflections included in the refinement | 0.2134 |
Goodness-of-fit parameter for all reflections included in the refinement | 1.015 |
Diffraction radiation wavelength | 0.71073 Å |
Diffraction radiation type | MoKα |