Information card for entry 7034648
Formula | C36 H56 Cl2 Co2 N14 O9 |
Calculated formula | C36 H56 Cl2 Co2 N14 O9 |
Title of publication | Inducing magnetic communication in caged dinuclear Co(ii) systems. |
Authors of publication | Caballero-Jiménez, Judith; Habib, Fatemah; Ramírez-Rosales, Daniel; Grande-Aztatzi, Rafael; Merino, Gabriel; Korobkov, Ilia; Singh, Mukesh Kumar; Rajaraman, Gopalan; Reyes-Ortega, Yasmi; Murugesu, Muralee |
Journal of publication | Dalton transactions (Cambridge, England : 2003) |
Year of publication | 2015 |
Journal volume | 44 |
Journal issue | 18 |
Pages of publication | 8649 - 8659 |
a | 8.9461 ± 0.0004 Å |
b | 29.4146 ± 0.0009 Å |
c | 18.0171 ± 0.0007 Å |
α | 90° |
β | 90° |
γ | 90° |
Cell volume | 4741.1 ± 0.3 Å3 |
Cell temperature | 200 ± 2 K |
Ambient diffraction temperature | 200 ± 2 K |
Number of distinct elements | 6 |
Space group number | 62 |
Hermann-Mauguin space group symbol | P n m a |
Hall space group symbol | -P 2ac 2n |
Residual factor for all reflections | 0.1368 |
Residual factor for significantly intense reflections | 0.113 |
Weighted residual factors for significantly intense reflections | 0.2937 |
Weighted residual factors for all reflections included in the refinement | 0.3113 |
Goodness-of-fit parameter for all reflections included in the refinement | 1.12 |
Diffraction radiation wavelength | 0.71073 Å |
Diffraction radiation type | MoKα |