Information card for entry 7034661
Formula | B18 Cd3 H38 O76 V12 |
Calculated formula | B18 Cd3 H18 O76 V12 |
Title of publication | A new 3-D open-framework cadmium borovanadate with plane-shaped channels and high catalytic activity for the oxidation of cyclohexanol. |
Authors of publication | Feng, Yuquan; Qiu, Dongfang; Fan, Huitao; Li, Min; Huang, Qunzeng; Shi, Hengzhen |
Journal of publication | Dalton transactions (Cambridge, England : 2003) |
Year of publication | 2015 |
Journal volume | 44 |
Journal issue | 19 |
Pages of publication | 8792 - 8796 |
a | 18.852 ± 0.009 Å |
b | 18.852 ± 0.009 Å |
c | 18.852 ± 0.009 Å |
α | 90° |
β | 90° |
γ | 90° |
Cell volume | 6700 ± 6 Å3 |
Cell temperature | 293 ± 2 K |
Ambient diffraction temperature | 293 ± 2 K |
Number of distinct elements | 5 |
Space group number | 201 |
Hermann-Mauguin space group symbol | P n -3 :2 |
Hall space group symbol | -P 2ab 2bc 3 |
Residual factor for all reflections | 0.1468 |
Residual factor for significantly intense reflections | 0.0936 |
Weighted residual factors for significantly intense reflections | 0.1828 |
Weighted residual factors for all reflections included in the refinement | 0.1991 |
Goodness-of-fit parameter for all reflections included in the refinement | 1.039 |
Diffraction radiation wavelength | 0.71073 Å |
Diffraction radiation type | MoKα |