Information card for entry 7034662
Formula | C36 H35 Cu3 N7 O46 Si W12 |
Calculated formula | C36 H28 Cu3 N7 O46 Si W12 |
Title of publication | Polyoxometalate-based organic-inorganic hybrid compounds containing transition metal mixed-organic-ligand complexes of N-containing and pyridinecarboxylate ligands. |
Authors of publication | Zhao, De-Chuan; Hu, Yang-Yang; Ding, Hong; Guo, Hai-Yang; Cui, Xiao-Bing; Zhang, Xiao; Huo, Qi-Sheng; Xu, Ji-Qing |
Journal of publication | Dalton transactions (Cambridge, England : 2003) |
Year of publication | 2015 |
Journal volume | 44 |
Journal issue | 19 |
Pages of publication | 8971 - 8983 |
a | 23.4183 ± 0.0007 Å |
b | 12.9661 ± 0.0003 Å |
c | 22.7238 ± 0.0007 Å |
α | 90° |
β | 109.508 ± 0.002° |
γ | 90° |
Cell volume | 6503.9 ± 0.3 Å3 |
Cell temperature | 293 ± 2 K |
Ambient diffraction temperature | 293 ± 2 K |
Number of distinct elements | 7 |
Space group number | 14 |
Hermann-Mauguin space group symbol | P 1 21/c 1 |
Hall space group symbol | -P 2ybc |
Residual factor for all reflections | 0.0991 |
Residual factor for significantly intense reflections | 0.0447 |
Weighted residual factors for significantly intense reflections | 0.0925 |
Weighted residual factors for all reflections included in the refinement | 0.1164 |
Goodness-of-fit parameter for all reflections included in the refinement | 1.009 |
Diffraction radiation wavelength | 0.71073 Å |
Diffraction radiation type | MoKα |