Information card for entry 7034668
Formula | F12 H18.78 K3.74 Mn7 Na8 O40.26 P8 |
Calculated formula | F12 K3.738 Mn7 Na8 O40.262 P8 |
Title of publication | Synthesis and characterization of mixed-valence manganese fluorophosphate and analogues with clathrate-like structures: Mn(III)6F12(PO3(OH))8[Na8(Kx(H3O)4-x(H2O)2)M(IV)(OH)6] (M(IV) = Mn, Ti, Ge). |
Authors of publication | Ren, Wei-Jian; Wang, Jing-Quan; Huang, Ya-Xi; Sun, Zhi-Mei; Pan, Yuanming; Mi, Jin-Xiao |
Journal of publication | Dalton transactions (Cambridge, England : 2003) |
Year of publication | 2015 |
Journal volume | 44 |
Journal issue | 17 |
Pages of publication | 7960 - 7966 |
a | 15.968 ± 0.002 Å |
b | 15.968 ± 0.002 Å |
c | 15.968 ± 0.002 Å |
α | 90° |
β | 90° |
γ | 90° |
Cell volume | 4071.5 ± 0.9 Å3 |
Cell temperature | 173 ± 2 K |
Ambient diffraction temperature | 173 ± 2 K |
Number of distinct elements | 7 |
Space group number | 202 |
Hermann-Mauguin space group symbol | F m -3 |
Hall space group symbol | -F 2 2 3 |
Residual factor for all reflections | 0.0378 |
Residual factor for significantly intense reflections | 0.0329 |
Weighted residual factors for significantly intense reflections | 0.1038 |
Weighted residual factors for all reflections included in the refinement | 0.1057 |
Goodness-of-fit parameter for all reflections included in the refinement | 1.184 |
Diffraction radiation wavelength | 0.71073 Å |
Diffraction radiation type | MoKα |