Information card for entry 7034667
Formula | F12 Ge H21.62 K2.79 Mn6 Na8 O41.21 P8 |
Calculated formula | F12 Ge K2.79 Mn6 Na8 O41.2076 P8 |
Title of publication | Synthesis and characterization of mixed-valence manganese fluorophosphate and analogues with clathrate-like structures: Mn(III)6F12(PO3(OH))8[Na8(Kx(H3O)4-x(H2O)2)M(IV)(OH)6] (M(IV) = Mn, Ti, Ge). |
Authors of publication | Ren, Wei-Jian; Wang, Jing-Quan; Huang, Ya-Xi; Sun, Zhi-Mei; Pan, Yuanming; Mi, Jin-Xiao |
Journal of publication | Dalton transactions (Cambridge, England : 2003) |
Year of publication | 2015 |
Journal volume | 44 |
Journal issue | 17 |
Pages of publication | 7960 - 7966 |
a | 15.981 ± 0.007 Å |
b | 15.981 ± 0.007 Å |
c | 15.981 ± 0.007 Å |
α | 90° |
β | 90° |
γ | 90° |
Cell volume | 4081 ± 3 Å3 |
Cell temperature | 173 ± 2 K |
Ambient diffraction temperature | 173 ± 2 K |
Number of distinct elements | 8 |
Space group number | 202 |
Hermann-Mauguin space group symbol | F m -3 |
Hall space group symbol | -F 2 2 3 |
Residual factor for all reflections | 0.0493 |
Residual factor for significantly intense reflections | 0.0421 |
Weighted residual factors for significantly intense reflections | 0.1162 |
Weighted residual factors for all reflections included in the refinement | 0.1212 |
Goodness-of-fit parameter for all reflections included in the refinement | 1.1 |
Diffraction radiation wavelength | 0.71073 Å |
Diffraction radiation type | MoKα |