Information card for entry 7034670
Formula | C32 H26 F24 |
Calculated formula | C32 H26 F24 |
Title of publication | Nanoheterogeneous catalysis in electrochemically induced olefin perfluoroalkylation. |
Authors of publication | Dudkina, Yulia B.; Gryaznova, Tatyana V.; Osin, Yuri N.; Salnikov, Vadim V.; Davydov, Nikolay A.; Fedorenko, Svetlana V.; Mustafina, Asia R.; Vicic, David A.; Sinyashin, Oleg G.; Budnikova, Yulia H. |
Journal of publication | Dalton transactions (Cambridge, England : 2003) |
Year of publication | 2015 |
Journal volume | 44 |
Journal issue | 19 |
Pages of publication | 8833 - 8838 |
a | 7.7287 ± 0.0009 Å |
b | 24.374 ± 0.003 Å |
c | 9.3149 ± 0.0011 Å |
α | 90° |
β | 102.31 ± 0.003° |
γ | 90° |
Cell volume | 1714.4 ± 0.4 Å3 |
Cell temperature | 135 ± 2 K |
Ambient diffraction temperature | 135 ± 2 K |
Number of distinct elements | 3 |
Space group number | 14 |
Hermann-Mauguin space group symbol | P 1 21/n 1 |
Hall space group symbol | -P 2yn |
Residual factor for all reflections | 0.0696 |
Residual factor for significantly intense reflections | 0.0544 |
Weighted residual factors for significantly intense reflections | 0.1396 |
Weighted residual factors for all reflections included in the refinement | 0.1537 |
Goodness-of-fit parameter for all reflections included in the refinement | 1.073 |
Diffraction radiation probe | x-ray |
Diffraction radiation wavelength | 0.71073 Å |
Diffraction radiation type | MoKα |