Information card for entry 7034671
Formula | C32 H26 F24 |
Calculated formula | C32 H26 F24 |
Title of publication | Nanoheterogeneous catalysis in electrochemically induced olefin perfluoroalkylation. |
Authors of publication | Dudkina, Yulia B.; Gryaznova, Tatyana V.; Osin, Yuri N.; Salnikov, Vadim V.; Davydov, Nikolay A.; Fedorenko, Svetlana V.; Mustafina, Asia R.; Vicic, David A.; Sinyashin, Oleg G.; Budnikova, Yulia H. |
Journal of publication | Dalton transactions (Cambridge, England : 2003) |
Year of publication | 2015 |
Journal volume | 44 |
Journal issue | 19 |
Pages of publication | 8833 - 8838 |
a | 27.503 ± 0.002 Å |
b | 11.0537 ± 0.0009 Å |
c | 11.5143 ± 0.0009 Å |
α | 90° |
β | 99.686 ± 0.002° |
γ | 90° |
Cell volume | 3450.6 ± 0.5 Å3 |
Cell temperature | 135 ± 2 K |
Ambient diffraction temperature | 135 ± 2 K |
Number of distinct elements | 3 |
Space group number | 14 |
Hermann-Mauguin space group symbol | P 1 21/c 1 |
Hall space group symbol | -P 2ybc |
Residual factor for all reflections | 0.1366 |
Residual factor for significantly intense reflections | 0.0735 |
Weighted residual factors for significantly intense reflections | 0.2002 |
Weighted residual factors for all reflections included in the refinement | 0.2405 |
Goodness-of-fit parameter for all reflections included in the refinement | 1.043 |
Diffraction radiation probe | x-ray |
Diffraction radiation wavelength | 0.71073 Å |
Diffraction radiation type | MoKα |