Information card for entry 7034677
Formula | C26 H34 N6 |
Calculated formula | C26 H34 N6 |
SMILES | C1(CCCCC1)(c1ccc(Cn2c(cc(C)n2)C)[nH]1)c1ccc(Cn2c(cc(C)n2)C)[nH]1 |
Title of publication | Synthesis and structural characterization of silver(i), copper(i) coordination polymers and a helicate palladium(ii) complex of dipyrrolylmethane-based dipyrazole ligands: the effect of meso substituents on structural formation. |
Authors of publication | Guchhait, Tapas; Barua, Bhagyasree; Biswas, Aritra; Basak, Biswanath; Mani, Ganesan |
Journal of publication | Dalton transactions (Cambridge, England : 2003) |
Year of publication | 2015 |
Journal volume | 44 |
Journal issue | 19 |
Pages of publication | 9091 - 9102 |
a | 9.48 ± 0.003 Å |
b | 11.937 ± 0.003 Å |
c | 12.185 ± 0.004 Å |
α | 93.786 ± 0.009° |
β | 107.308 ± 0.009° |
γ | 111.81 ± 0.008° |
Cell volume | 1197.7 ± 0.6 Å3 |
Cell temperature | 293 ± 2 K |
Ambient diffraction temperature | 293 ± 2 K |
Number of distinct elements | 3 |
Space group number | 2 |
Hermann-Mauguin space group symbol | P -1 |
Hall space group symbol | -P 1 |
Residual factor for all reflections | 0.101 |
Residual factor for significantly intense reflections | 0.0535 |
Weighted residual factors for significantly intense reflections | 0.1294 |
Weighted residual factors for all reflections included in the refinement | 0.1519 |
Goodness-of-fit parameter for all reflections included in the refinement | 1.024 |
Diffraction radiation wavelength | 0.71073 Å |
Diffraction radiation type | MoKα |