Information card for entry 7034678
Formula | C51 H70 Ag2 B2 Cl2 F8 N12 |
Calculated formula | C51 H70 Ag2 B2 Cl2 F8 N12 |
Title of publication | Synthesis and structural characterization of silver(i), copper(i) coordination polymers and a helicate palladium(ii) complex of dipyrrolylmethane-based dipyrazole ligands: the effect of meso substituents on structural formation. |
Authors of publication | Guchhait, Tapas; Barua, Bhagyasree; Biswas, Aritra; Basak, Biswanath; Mani, Ganesan |
Journal of publication | Dalton transactions (Cambridge, England : 2003) |
Year of publication | 2015 |
Journal volume | 44 |
Journal issue | 19 |
Pages of publication | 9091 - 9102 |
a | 13.881 ± 0.005 Å |
b | 14.747 ± 0.005 Å |
c | 14.992 ± 0.005 Å |
α | 94.048 ± 0.005° |
β | 95.837 ± 0.005° |
γ | 105.845 ± 0.005° |
Cell volume | 2921.4 ± 1.7 Å3 |
Cell temperature | 293 ± 2 K |
Ambient diffraction temperature | 293 ± 2 K |
Number of distinct elements | 7 |
Space group number | 2 |
Hermann-Mauguin space group symbol | P -1 |
Hall space group symbol | -P 1 |
Residual factor for all reflections | 0.2173 |
Residual factor for significantly intense reflections | 0.0709 |
Weighted residual factors for significantly intense reflections | 0.1354 |
Weighted residual factors for all reflections included in the refinement | 0.1894 |
Goodness-of-fit parameter for all reflections included in the refinement | 0.958 |
Diffraction radiation wavelength | 0.71073 Å |
Diffraction radiation type | MoKα |