Information card for entry 7034680
Formula | C25 H34 Cu I N6 |
Calculated formula | C25 H34 Cu I N6 |
Title of publication | Synthesis and structural characterization of silver(i), copper(i) coordination polymers and a helicate palladium(ii) complex of dipyrrolylmethane-based dipyrazole ligands: the effect of meso substituents on structural formation. |
Authors of publication | Guchhait, Tapas; Barua, Bhagyasree; Biswas, Aritra; Basak, Biswanath; Mani, Ganesan |
Journal of publication | Dalton transactions (Cambridge, England : 2003) |
Year of publication | 2015 |
Journal volume | 44 |
Journal issue | 19 |
Pages of publication | 9091 - 9102 |
a | 9.8269 ± 0.0014 Å |
b | 21.536 ± 0.003 Å |
c | 13.757 ± 0.002 Å |
α | 90° |
β | 106.645 ± 0.004° |
γ | 90° |
Cell volume | 2789.4 ± 0.7 Å3 |
Cell temperature | 293 ± 2 K |
Ambient diffraction temperature | 293 ± 2 K |
Number of distinct elements | 5 |
Space group number | 14 |
Hermann-Mauguin space group symbol | P 1 21/n 1 |
Hall space group symbol | -P 2yn |
Residual factor for all reflections | 0.1473 |
Residual factor for significantly intense reflections | 0.0731 |
Weighted residual factors for significantly intense reflections | 0.1563 |
Weighted residual factors for all reflections included in the refinement | 0.1877 |
Goodness-of-fit parameter for all reflections included in the refinement | 1.109 |
Diffraction radiation wavelength | 0.71073 Å |
Diffraction radiation type | MoKα |