Information card for entry 7034679
Formula | C52 H68 Ag2 B2 F8 N12 |
Calculated formula | C52 H68 Ag2 B2 F8 N12 |
Title of publication | Synthesis and structural characterization of silver(i), copper(i) coordination polymers and a helicate palladium(ii) complex of dipyrrolylmethane-based dipyrazole ligands: the effect of meso substituents on structural formation. |
Authors of publication | Guchhait, Tapas; Barua, Bhagyasree; Biswas, Aritra; Basak, Biswanath; Mani, Ganesan |
Journal of publication | Dalton transactions (Cambridge, England : 2003) |
Year of publication | 2015 |
Journal volume | 44 |
Journal issue | 19 |
Pages of publication | 9091 - 9102 |
a | 12.5254 ± 0.0018 Å |
b | 12.5882 ± 0.0018 Å |
c | 19.034 ± 0.003 Å |
α | 86.019 ± 0.005° |
β | 89.755 ± 0.005° |
γ | 65.575 ± 0.004° |
Cell volume | 2725 ± 0.7 Å3 |
Cell temperature | 293 ± 2 K |
Ambient diffraction temperature | 293 ± 2 K |
Number of distinct elements | 6 |
Space group number | 2 |
Hermann-Mauguin space group symbol | P -1 |
Hall space group symbol | -P 1 |
Residual factor for all reflections | 0.137 |
Residual factor for significantly intense reflections | 0.0659 |
Weighted residual factors for significantly intense reflections | 0.157 |
Weighted residual factors for all reflections included in the refinement | 0.1967 |
Goodness-of-fit parameter for all reflections included in the refinement | 1.032 |
Diffraction radiation wavelength | 0.71073 Å |
Diffraction radiation type | MoKα |