Information card for entry 7034696
Formula | C13 H12 F5 N2 O4 Re |
Calculated formula | C13 H12 F5 N2 O4 Re |
SMILES | Fc1c(Cn2c([n+](cc2)C)CC)c(F)c(F)c(F)c1F.[Re](=O)(=O)(=O)[O-] |
Title of publication | Influence of substituents on cation-anion contacts in imidazolium perrhenates. |
Authors of publication | Reich, Robert M.; Cokoja, Mirza; Markovits, Iulius I. E.; Münchmeyer, Christian J; Kaposi, Marlene; Pöthig, Alexander; Herrmann, Wolfgang A.; Kühn, Fritz E |
Journal of publication | Dalton transactions (Cambridge, England : 2003) |
Year of publication | 2015 |
Journal volume | 44 |
Journal issue | 18 |
Pages of publication | 8669 - 8677 |
a | 10.3689 ± 0.0003 Å |
b | 18.6571 ± 0.0007 Å |
c | 8.4223 ± 0.0003 Å |
α | 90° |
β | 90° |
γ | 90° |
Cell volume | 1629.32 ± 0.1 Å3 |
Cell temperature | 123 K |
Ambient diffraction temperature | 123 K |
Number of distinct elements | 6 |
Space group number | 33 |
Hermann-Mauguin space group symbol | P n a 21 |
Hall space group symbol | P 2c -2n |
Residual factor for all reflections | 0.0442 |
Residual factor for significantly intense reflections | 0.0287 |
Weighted residual factors for significantly intense reflections | 0.0441 |
Weighted residual factors for all reflections included in the refinement | 0.0478 |
Goodness-of-fit parameter for all reflections included in the refinement | 0.974 |
Diffraction radiation probe | x-ray |
Diffraction radiation wavelength | 0.71073 Å |
Diffraction radiation type | MoKα |