Information card for entry 7034697
Formula | C14 H14 F5 N2 O4 Re |
Calculated formula | C14 H14 F5 N2 O4 Re |
SMILES | Fc1c(F)c(F)c(Cn2c([n+](cc2)C)C(C)C)c(F)c1F.[Re](=O)(=O)(=O)[O-] |
Title of publication | Influence of substituents on cation-anion contacts in imidazolium perrhenates. |
Authors of publication | Reich, Robert M.; Cokoja, Mirza; Markovits, Iulius I. E.; Münchmeyer, Christian J; Kaposi, Marlene; Pöthig, Alexander; Herrmann, Wolfgang A.; Kühn, Fritz E |
Journal of publication | Dalton transactions (Cambridge, England : 2003) |
Year of publication | 2015 |
Journal volume | 44 |
Journal issue | 18 |
Pages of publication | 8669 - 8677 |
a | 9.6255 ± 0.0003 Å |
b | 11.6206 ± 0.0004 Å |
c | 15.4559 ± 0.0005 Å |
α | 90° |
β | 90° |
γ | 90° |
Cell volume | 1728.81 ± 0.1 Å3 |
Cell temperature | 123 K |
Ambient diffraction temperature | 123 K |
Number of distinct elements | 6 |
Space group number | 19 |
Hermann-Mauguin space group symbol | P 21 21 21 |
Hall space group symbol | P 2ac 2ab |
Residual factor for all reflections | 0.0221 |
Residual factor for significantly intense reflections | 0.0205 |
Weighted residual factors for significantly intense reflections | 0.047 |
Weighted residual factors for all reflections included in the refinement | 0.0474 |
Goodness-of-fit parameter for all reflections included in the refinement | 1.032 |
Diffraction radiation probe | x-ray |
Diffraction radiation wavelength | 0.71073 Å |
Diffraction radiation type | MoKα |