Information card for entry 7034702
Formula | C56 H76 Cl0.79 Cu8 N11.21 O25.62 |
Calculated formula | C56 H76 Cl0.8 Cu8 N11.2 O25.6 |
Title of publication | Turning a "useless" ligand into a "useful" ligand: a magneto-structural study of an unusual family of Cu(II) wheels derived from functionalised phenolic oximes. |
Authors of publication | Frost, Jamie M.; Stirling, Robert J.; Sanz, Sergio; Vyas, Nidhi; Nichol, Gary S.; Rajaraman, Gopalan; Brechin, Euan K. |
Journal of publication | Dalton transactions (Cambridge, England : 2003) |
Year of publication | 2015 |
Journal volume | 44 |
Journal issue | 22 |
Pages of publication | 10177 - 10187 |
a | 20.2162 ± 0.0004 Å |
b | 20.2162 ± 0.0004 Å |
c | 16.8492 ± 0.0003 Å |
α | 90° |
β | 90° |
γ | 120° |
Cell volume | 5963.6 ± 0.2 Å3 |
Cell temperature | 170 K |
Ambient diffraction temperature | 170 K |
Number of distinct elements | 6 |
Space group number | 171 |
Hermann-Mauguin space group symbol | P 62 |
Hall space group symbol | P 62 |
Residual factor for all reflections | 0.0436 |
Residual factor for significantly intense reflections | 0.0378 |
Weighted residual factors for significantly intense reflections | 0.1083 |
Weighted residual factors for all reflections included in the refinement | 0.1126 |
Goodness-of-fit parameter for all reflections included in the refinement | 1.089 |
Diffraction radiation wavelength | 0.7107 Å |
Diffraction radiation type | MoKα |