Information card for entry 7034703
Formula | C90.78 H129.13 B2 Cu8 F8 N12 O24.78 |
Calculated formula | C90.7828 H129.128 B2 Cu8 F8 N12 O24.7822 |
Title of publication | Turning a "useless" ligand into a "useful" ligand: a magneto-structural study of an unusual family of Cu(II) wheels derived from functionalised phenolic oximes. |
Authors of publication | Frost, Jamie M.; Stirling, Robert J.; Sanz, Sergio; Vyas, Nidhi; Nichol, Gary S.; Rajaraman, Gopalan; Brechin, Euan K. |
Journal of publication | Dalton transactions (Cambridge, England : 2003) |
Year of publication | 2015 |
Journal volume | 44 |
Journal issue | 22 |
Pages of publication | 10177 - 10187 |
a | 23.3511 ± 0.0004 Å |
b | 17.1783 ± 0.0002 Å |
c | 26.251 ± 0.0005 Å |
α | 90° |
β | 101.024 ± 0.0017° |
γ | 90° |
Cell volume | 10335.8 ± 0.3 Å3 |
Cell temperature | 120 K |
Ambient diffraction temperature | 120 K |
Number of distinct elements | 7 |
Space group number | 15 |
Hermann-Mauguin space group symbol | C 1 2/c 1 |
Hall space group symbol | -C 2yc |
Residual factor for all reflections | 0.0579 |
Residual factor for significantly intense reflections | 0.041 |
Weighted residual factors for significantly intense reflections | 0.0946 |
Weighted residual factors for all reflections included in the refinement | 0.1035 |
Goodness-of-fit parameter for all reflections included in the refinement | 1.037 |
Diffraction radiation wavelength | 0.7107 Å |
Diffraction radiation type | MoKα |