Information card for entry 7034705
Formula | C56 H76 Cu6 N8 O16 |
Calculated formula | C56 H76 Cu6 N8 O16 |
Title of publication | Turning a "useless" ligand into a "useful" ligand: a magneto-structural study of an unusual family of Cu(II) wheels derived from functionalised phenolic oximes. |
Authors of publication | Frost, Jamie M.; Stirling, Robert J.; Sanz, Sergio; Vyas, Nidhi; Nichol, Gary S.; Rajaraman, Gopalan; Brechin, Euan K. |
Journal of publication | Dalton transactions (Cambridge, England : 2003) |
Year of publication | 2015 |
Journal volume | 44 |
Journal issue | 22 |
Pages of publication | 10177 - 10187 |
a | 14.5984 ± 0.0003 Å |
b | 26.6204 ± 0.0007 Å |
c | 18.8428 ± 0.0004 Å |
α | 90° |
β | 104.153 ± 0.002° |
γ | 90° |
Cell volume | 7100.3 ± 0.3 Å3 |
Cell temperature | 120 K |
Ambient diffraction temperature | 120 K |
Number of distinct elements | 5 |
Space group number | 15 |
Hermann-Mauguin space group symbol | C 1 2/c 1 |
Hall space group symbol | -C 2yc |
Residual factor for all reflections | 0.061 |
Residual factor for significantly intense reflections | 0.0486 |
Weighted residual factors for significantly intense reflections | 0.1316 |
Weighted residual factors for all reflections included in the refinement | 0.141 |
Goodness-of-fit parameter for all reflections included in the refinement | 1.056 |
Diffraction radiation wavelength | 1.54184 Å |
Diffraction radiation type | CuKα |