Information card for entry 7034704
Formula | C67 H120 Cu8 N20 O27 |
Calculated formula | C56 H76 Cu8 N20 O16 |
Title of publication | Turning a "useless" ligand into a "useful" ligand: a magneto-structural study of an unusual family of Cu(II) wheels derived from functionalised phenolic oximes. |
Authors of publication | Frost, Jamie M.; Stirling, Robert J.; Sanz, Sergio; Vyas, Nidhi; Nichol, Gary S.; Rajaraman, Gopalan; Brechin, Euan K. |
Journal of publication | Dalton transactions (Cambridge, England : 2003) |
Year of publication | 2015 |
Journal volume | 44 |
Journal issue | 22 |
Pages of publication | 10177 - 10187 |
a | 25.299 ± 0.0005 Å |
b | 20.7375 ± 0.0004 Å |
c | 32.5445 ± 0.0008 Å |
α | 90° |
β | 90° |
γ | 90° |
Cell volume | 17074.1 ± 0.6 Å3 |
Cell temperature | 120 K |
Ambient diffraction temperature | 120 K |
Number of distinct elements | 5 |
Space group number | 61 |
Hermann-Mauguin space group symbol | P b c a |
Hall space group symbol | -P 2ac 2ab |
Residual factor for all reflections | 0.1251 |
Residual factor for significantly intense reflections | 0.0956 |
Weighted residual factors for significantly intense reflections | 0.2426 |
Weighted residual factors for all reflections included in the refinement | 0.2636 |
Goodness-of-fit parameter for all reflections included in the refinement | 1.07 |
Diffraction radiation wavelength | 1.54184 Å |
Diffraction radiation type | CuKα |