Information card for entry 7034734
Formula | C43 H60 Cl Li3 N2 O4 Si4 |
Calculated formula | C43 H60 Cl Li3 N2 O4 Si4 |
Title of publication | Group 4 metal compounds incorporating the amide ligand, [N(SiMe2{C6H4-2-OMe})2](.). |
Authors of publication | Evans, Lloyd T. J.; Farnaby, Joy H.; Coles, Martyn P.; Cloke, F Geoffrey N; Hitchcock, Peter B. |
Journal of publication | Dalton transactions (Cambridge, England : 2003) |
Year of publication | 2015 |
Journal volume | 44 |
Journal issue | 19 |
Pages of publication | 8950 - 8958 |
a | 9.6309 ± 0.0003 Å |
b | 15.2563 ± 0.0005 Å |
c | 17.3137 ± 0.0004 Å |
α | 76.54 ± 0.002° |
β | 76.011 ± 0.002° |
γ | 85.534 ± 0.002° |
Cell volume | 2400.06 ± 0.13 Å3 |
Cell temperature | 173 ± 2 K |
Ambient diffraction temperature | 173 ± 2 K |
Number of distinct elements | 7 |
Space group number | 2 |
Hermann-Mauguin space group symbol | P -1 |
Hall space group symbol | -P 1 |
Residual factor for all reflections | 0.0787 |
Residual factor for significantly intense reflections | 0.052 |
Weighted residual factors for significantly intense reflections | 0.1172 |
Weighted residual factors for all reflections included in the refinement | 0.1303 |
Goodness-of-fit parameter for all reflections included in the refinement | 1.026 |
Diffraction radiation probe | x-ray |
Diffraction radiation wavelength | 0.71073 Å |
Diffraction radiation type | MoKα |