Information card for entry 7034756
Formula | C24 H13 Au Cl F10 N3 O4 |
Calculated formula | C24 H13 Au Cl F10 N3 O4 |
SMILES | [Au]1(c2c(c(c(c(c2F)F)F)F)F)(c2c(c(c(c(c2F)F)F)F)F)[n]2ccccc2C[NH]1Cc1ccccn1.Cl(=O)(=O)(=O)[O-] |
Title of publication | The fluxional amine gold(iii) complex as an excellent catalyst and precursor of biologically active acyclic carbenes. |
Authors of publication | Montanel-Pérez, Sara; Herrera, Raquel P.; Laguna, Antonio; Villacampa, M. Dolores; Gimeno, M Concepción |
Journal of publication | Dalton transactions (Cambridge, England : 2003) |
Year of publication | 2015 |
Journal volume | 44 |
Journal issue | 19 |
Pages of publication | 9052 - 9062 |
a | 15.629 ± 0.002 Å |
b | 9.8536 ± 0.0015 Å |
c | 16.354 ± 0.002 Å |
α | 90° |
β | 101.68 ± 0.002° |
γ | 90° |
Cell volume | 2466.4 ± 0.6 Å3 |
Cell temperature | 100 ± 2 K |
Ambient diffraction temperature | 100 ± 2 K |
Number of distinct elements | 7 |
Space group number | 14 |
Hermann-Mauguin space group symbol | P 1 21/c 1 |
Hall space group symbol | -P 2ybc |
Residual factor for all reflections | 0.0295 |
Residual factor for significantly intense reflections | 0.0236 |
Weighted residual factors for significantly intense reflections | 0.0485 |
Weighted residual factors for all reflections included in the refinement | 0.056 |
Goodness-of-fit parameter for all reflections included in the refinement | 1.11 |
Diffraction radiation wavelength | 0.71073 Å |
Diffraction radiation type | MoKα |