Information card for entry 7034757
Formula | C38 H26 Au Cl F10 N4 O5 |
Calculated formula | C38 H26 Au Cl F10 N4 O5 |
SMILES | [Au]1(=C(N(Cc2[n]1cccc2)Cc1ncccc1)Nc1ccc2ccccc2c1)(c1c(c(c(c(c1F)F)F)F)F)c1c(c(c(c(c1F)F)F)F)F.Cl(=O)(=O)(=O)[O-].CC(=O)C |
Title of publication | The fluxional amine gold(iii) complex as an excellent catalyst and precursor of biologically active acyclic carbenes. |
Authors of publication | Montanel-Pérez, Sara; Herrera, Raquel P.; Laguna, Antonio; Villacampa, M. Dolores; Gimeno, M Concepción |
Journal of publication | Dalton transactions (Cambridge, England : 2003) |
Year of publication | 2015 |
Journal volume | 44 |
Journal issue | 19 |
Pages of publication | 9052 - 9062 |
a | 8.1961 ± 0.0016 Å |
b | 11.368 ± 0.002 Å |
c | 20.475 ± 0.004 Å |
α | 97.15 ± 0.03° |
β | 101.31 ± 0.03° |
γ | 101.21 ± 0.03° |
Cell volume | 1808.6 ± 0.7 Å3 |
Cell temperature | 100 ± 2 K |
Ambient diffraction temperature | 100 ± 2 K |
Number of distinct elements | 7 |
Space group number | 2 |
Hermann-Mauguin space group symbol | P -1 |
Hall space group symbol | -P 1 |
Residual factor for all reflections | 0.0615 |
Residual factor for significantly intense reflections | 0.0515 |
Weighted residual factors for significantly intense reflections | 0.1136 |
Weighted residual factors for all reflections included in the refinement | 0.1178 |
Goodness-of-fit parameter for all reflections included in the refinement | 1.099 |
Diffraction radiation wavelength | 0.71073 Å |
Diffraction radiation type | MoKα |