Information card for entry 7034777
Formula | C27 H40 Cl2 N2 Sn |
Calculated formula | C27 H40 Cl2 N2 Sn |
SMILES | c1(c(cccc1C(C)C)C(C)C)N1[Sn](Cl)(Cl)N(c2c(cccc2C(C)C)C(C)C)CCC1 |
Title of publication | Synthesis of chelating diamido Sn(iv) compounds from oxidation of Sn(ii) and directly from Sn(iv) precursors. |
Authors of publication | Mansell, S. M.; Russell, C. A.; Wass, D. F. |
Journal of publication | Dalton transactions (Cambridge, England : 2003) |
Year of publication | 2015 |
Journal volume | 44 |
Journal issue | 21 |
Pages of publication | 9756 - 9765 |
a | 12.053 ± 0.002 Å |
b | 22.006 ± 0.004 Å |
c | 10.47 ± 0.002 Å |
α | 90° |
β | 90° |
γ | 90° |
Cell volume | 2777 ± 0.9 Å3 |
Cell temperature | 100 ± 2 K |
Ambient diffraction temperature | 100 ± 2 K |
Number of distinct elements | 5 |
Space group number | 62 |
Hermann-Mauguin space group symbol | P n m a |
Hall space group symbol | -P 2ac 2n |
Residual factor for all reflections | 0.0259 |
Residual factor for significantly intense reflections | 0.0235 |
Weighted residual factors for significantly intense reflections | 0.06 |
Weighted residual factors for all reflections included in the refinement | 0.0607 |
Goodness-of-fit parameter for all reflections included in the refinement | 1.432 |
Diffraction radiation wavelength | 0.71073 Å |
Diffraction radiation type | MoKα |