Information card for entry 7034782
Formula | C27 H41 I N2 Sn |
Calculated formula | C27 H41 I N2 Sn |
SMILES | [Sn]1(N(c2c(cccc2C(C)C)C(C)C)CCN1c1c(cccc1C(C)C)C(C)C)(I)C |
Title of publication | Synthesis of chelating diamido Sn(iv) compounds from oxidation of Sn(ii) and directly from Sn(iv) precursors. |
Authors of publication | Mansell, S. M.; Russell, C. A.; Wass, D. F. |
Journal of publication | Dalton transactions (Cambridge, England : 2003) |
Year of publication | 2015 |
Journal volume | 44 |
Journal issue | 21 |
Pages of publication | 9756 - 9765 |
a | 9.5611 ± 0.0003 Å |
b | 15.7041 ± 0.0005 Å |
c | 19.0768 ± 0.0006 Å |
α | 90° |
β | 95.759 ± 0.001° |
γ | 90° |
Cell volume | 2849.9 ± 0.16 Å3 |
Cell temperature | 173 ± 2 K |
Ambient diffraction temperature | 173 ± 2 K |
Number of distinct elements | 5 |
Space group number | 14 |
Hermann-Mauguin space group symbol | P 1 21/n 1 |
Hall space group symbol | -P 2yn |
Residual factor for all reflections | 0.0304 |
Residual factor for significantly intense reflections | 0.0235 |
Weighted residual factors for significantly intense reflections | 0.0555 |
Weighted residual factors for all reflections included in the refinement | 0.0588 |
Goodness-of-fit parameter for all reflections included in the refinement | 1.039 |
Diffraction radiation wavelength | 0.71073 Å |
Diffraction radiation type | MoKα |