Information card for entry 7034786
Formula | C28 H41 F3 N2 O3 S Sn |
Calculated formula | C28 H41 F3 N2 O3 S Sn |
SMILES | [Sn]1(N(c2c(cccc2C(C)C)C(C)C)CCN1c1c(cccc1C(C)C)C(C)C)(C)OS(=O)(=O)C(F)(F)F |
Title of publication | Synthesis of chelating diamido Sn(iv) compounds from oxidation of Sn(ii) and directly from Sn(iv) precursors. |
Authors of publication | Mansell, S. M.; Russell, C. A.; Wass, D. F. |
Journal of publication | Dalton transactions (Cambridge, England : 2003) |
Year of publication | 2015 |
Journal volume | 44 |
Journal issue | 21 |
Pages of publication | 9756 - 9765 |
a | 11.855 ± 0.004 Å |
b | 21.038 ± 0.007 Å |
c | 12.201 ± 0.007 Å |
α | 90° |
β | 90.8 ± 0.03° |
γ | 90° |
Cell volume | 3043 ± 2 Å3 |
Cell temperature | 100 ± 2 K |
Ambient diffraction temperature | 100 ± 2 K |
Number of distinct elements | 7 |
Space group number | 14 |
Hermann-Mauguin space group symbol | P 1 21/n 1 |
Hall space group symbol | -P 2yn |
Residual factor for all reflections | 0.051 |
Residual factor for significantly intense reflections | 0.044 |
Weighted residual factors for significantly intense reflections | 0.1035 |
Weighted residual factors for all reflections included in the refinement | 0.112 |
Goodness-of-fit parameter for all reflections included in the refinement | 1.233 |
Diffraction radiation wavelength | 0.71073 Å |
Diffraction radiation type | MoKα |