Information card for entry 7034787
Formula | C29 H43 F3 N2 O3 S Sn |
Calculated formula | C29 H43 F3 N2 O3 S Sn |
SMILES | [Sn]1(N(c2c(cccc2C(C)C)C(C)C)CCCN1c1c(cccc1C(C)C)C(C)C)(C)OS(=O)(=O)C(F)(F)F |
Title of publication | Synthesis of chelating diamido Sn(iv) compounds from oxidation of Sn(ii) and directly from Sn(iv) precursors. |
Authors of publication | Mansell, S. M.; Russell, C. A.; Wass, D. F. |
Journal of publication | Dalton transactions (Cambridge, England : 2003) |
Year of publication | 2015 |
Journal volume | 44 |
Journal issue | 21 |
Pages of publication | 9756 - 9765 |
a | 12.227 ± 0.002 Å |
b | 14.922 ± 0.003 Å |
c | 19.768 ± 0.004 Å |
α | 104.833 ± 0.003° |
β | 102.68 ± 0.003° |
γ | 105.209 ± 0.003° |
Cell volume | 3201.6 ± 1.1 Å3 |
Cell temperature | 173 ± 2 K |
Ambient diffraction temperature | 173 ± 2 K |
Number of distinct elements | 7 |
Space group number | 2 |
Hermann-Mauguin space group symbol | P -1 |
Hall space group symbol | -P 1 |
Residual factor for all reflections | 0.179 |
Residual factor for significantly intense reflections | 0.0704 |
Weighted residual factors for significantly intense reflections | 0.1451 |
Weighted residual factors for all reflections included in the refinement | 0.1946 |
Goodness-of-fit parameter for all reflections included in the refinement | 0.932 |
Diffraction radiation wavelength | 0.71073 Å |
Diffraction radiation type | MoKα |