Information card for entry 7034803
Formula | C30 H30 F16 Ga2 N6 O4 P2 |
Calculated formula | C30 H30 F16 Ga2 N6 O4 P2 |
SMILES | c1c2[n]3[Ga]4(F)([n]5c2cccc5)([F][Ga]25([F]4)(F)[n]4ccccc4c4cccc([n]24)c2[n]5cccc2)[n]2ccccc2c3cc1.[P](F)(F)(F)(F)(F)[F-].O.O.[P](F)(F)(F)(F)(F)[F-].O.O |
Title of publication | Hydrothermal synthesis of Group 13 metal trifluoride complexes with neutral N-donor ligands. |
Authors of publication | Bhalla, Rajiv; Levason, William; Luthra, Sajinder K.; McRobbie, Graeme; Monzittu, Francesco M.; Palmer, Jazmyn; Reid, Gillian; Sanderson, George; Zhang, Wenjian |
Journal of publication | Dalton transactions (Cambridge, England : 2003) |
Year of publication | 2015 |
Journal volume | 44 |
Journal issue | 20 |
Pages of publication | 9569 - 9580 |
a | 9.774 ± 0.002 Å |
b | 10.46 ± 0.002 Å |
c | 10.646 ± 0.002 Å |
α | 78.064 ± 0.012° |
β | 62.736 ± 0.008° |
γ | 85.448 ± 0.014° |
Cell volume | 946.4 ± 0.3 Å3 |
Cell temperature | 100 ± 2 K |
Ambient diffraction temperature | 100 ± 2 K |
Number of distinct elements | 7 |
Space group number | 2 |
Hermann-Mauguin space group symbol | P -1 |
Hall space group symbol | -P 1 |
Residual factor for all reflections | 0.0491 |
Residual factor for significantly intense reflections | 0.0433 |
Weighted residual factors for significantly intense reflections | 0.1086 |
Weighted residual factors for all reflections included in the refinement | 0.1113 |
Goodness-of-fit parameter for all reflections included in the refinement | 0.986 |
Diffraction radiation wavelength | 0.71075 Å |
Diffraction radiation type | MoKα |