Information card for entry 7034804
Formula | C28 H37 Cl8 Ga2 N3 |
Calculated formula | C28 H37 Cl8 Ga2 N3 |
SMILES | [Ga]12(Cl)(Cl)[n]3c(c4[n]2ccc(c4)C(C)(C)C)cc(C(C)(C)C)cc3c2[n]1ccc(c2)C(C)(C)C.[Ga](Cl)(Cl)(Cl)[Cl-].ClCCl |
Title of publication | Hydrothermal synthesis of Group 13 metal trifluoride complexes with neutral N-donor ligands. |
Authors of publication | Bhalla, Rajiv; Levason, William; Luthra, Sajinder K.; McRobbie, Graeme; Monzittu, Francesco M.; Palmer, Jazmyn; Reid, Gillian; Sanderson, George; Zhang, Wenjian |
Journal of publication | Dalton transactions (Cambridge, England : 2003) |
Year of publication | 2015 |
Journal volume | 44 |
Journal issue | 20 |
Pages of publication | 9569 - 9580 |
a | 11.674 ± 0.003 Å |
b | 12.642 ± 0.004 Å |
c | 13.756 ± 0.005 Å |
α | 89.137 ± 0.017° |
β | 78.682 ± 0.016° |
γ | 65.276 ± 0.015° |
Cell volume | 1803.1 ± 1 Å3 |
Cell temperature | 100 ± 2 K |
Ambient diffraction temperature | 100 ± 2 K |
Number of distinct elements | 5 |
Space group number | 2 |
Hermann-Mauguin space group symbol | P -1 |
Hall space group symbol | -P 1 |
Residual factor for all reflections | 0.125 |
Residual factor for significantly intense reflections | 0.0862 |
Weighted residual factors for significantly intense reflections | 0.1924 |
Weighted residual factors for all reflections included in the refinement | 0.2111 |
Goodness-of-fit parameter for all reflections included in the refinement | 0.877 |
Diffraction radiation wavelength | 0.71075 Å |
Diffraction radiation type | MoKα |