Information card for entry 7034805
Chemical name | aqua(2,2'-bipyridine)trifluorogallium(III) dihydrate |
Formula | C10 H14 F3 Ga N2 O3 |
Calculated formula | C10 H14 F3 Ga N2 O3 |
Title of publication | Hydrothermal synthesis of Group 13 metal trifluoride complexes with neutral N-donor ligands. |
Authors of publication | Bhalla, Rajiv; Levason, William; Luthra, Sajinder K.; McRobbie, Graeme; Monzittu, Francesco M.; Palmer, Jazmyn; Reid, Gillian; Sanderson, George; Zhang, Wenjian |
Journal of publication | Dalton transactions (Cambridge, England : 2003) |
Year of publication | 2015 |
Journal volume | 44 |
Journal issue | 20 |
Pages of publication | 9569 - 9580 |
a | 9.056 ± 0.003 Å |
b | 7.371 ± 0.002 Å |
c | 18.904 ± 0.006 Å |
α | 90° |
β | 93.462 ± 0.006° |
γ | 90° |
Cell volume | 1259.6 ± 0.7 Å3 |
Cell temperature | 100 ± 2 K |
Ambient diffraction temperature | 100 ± 2 K |
Number of distinct elements | 6 |
Space group number | 14 |
Hermann-Mauguin space group symbol | P 1 21/n 1 |
Hall space group symbol | -P 2yn |
Residual factor for all reflections | 0.0509 |
Residual factor for significantly intense reflections | 0.0484 |
Weighted residual factors for significantly intense reflections | 0.1298 |
Weighted residual factors for all reflections included in the refinement | 0.1324 |
Goodness-of-fit parameter for all reflections included in the refinement | 1.05 |
Diffraction radiation wavelength | 0.71073 Å |
Diffraction radiation type | MoKα |