Information card for entry 7034810
Formula | C26 H18 Co N4 O4 |
Calculated formula | C26 H18 Co N4 O4 |
Title of publication | 1D-3D mixed-ligand frameworks with an unusual dmp topology tuned by intersection angles of isomeric benzenedicarboxylates: magnetic properties, gas-dependent calcination-thermolysis and energy storage performances. |
Authors of publication | Li, Zuo-Xi; Ye, Gan; Han, Juan; Yang, Ying; Zou, Kang-Yu; Wang, Xin; Wang, Xiao-Ling; Gou, Xiao-Feng |
Journal of publication | Dalton transactions (Cambridge, England : 2003) |
Year of publication | 2015 |
Journal volume | 44 |
Journal issue | 19 |
Pages of publication | 9209 - 9220 |
a | 9.99 ± 0.004 Å |
b | 10.046 ± 0.004 Å |
c | 11.176 ± 0.005 Å |
α | 92.603 ± 0.006° |
β | 92.028 ± 0.006° |
γ | 97.537 ± 0.007° |
Cell volume | 1109.8 ± 0.8 Å3 |
Cell temperature | 293 ± 2 K |
Ambient diffraction temperature | 293 ± 2 K |
Number of distinct elements | 5 |
Space group number | 2 |
Hermann-Mauguin space group symbol | P -1 |
Hall space group symbol | -P 1 |
Residual factor for all reflections | 0.0408 |
Residual factor for significantly intense reflections | 0.0345 |
Weighted residual factors for significantly intense reflections | 0.0898 |
Weighted residual factors for all reflections included in the refinement | 0.0939 |
Goodness-of-fit parameter for all reflections included in the refinement | 1.088 |
Diffraction radiation wavelength | 0.71073 Å |
Diffraction radiation type | MoKα |