Information card for entry 7034811
Formula | C26 H18 Co N4 O4 |
Calculated formula | C26 H18 Co N4 O4 |
Title of publication | 1D-3D mixed-ligand frameworks with an unusual dmp topology tuned by intersection angles of isomeric benzenedicarboxylates: magnetic properties, gas-dependent calcination-thermolysis and energy storage performances. |
Authors of publication | Li, Zuo-Xi; Ye, Gan; Han, Juan; Yang, Ying; Zou, Kang-Yu; Wang, Xin; Wang, Xiao-Ling; Gou, Xiao-Feng |
Journal of publication | Dalton transactions (Cambridge, England : 2003) |
Year of publication | 2015 |
Journal volume | 44 |
Journal issue | 19 |
Pages of publication | 9209 - 9220 |
a | 13.152 ± 0.003 Å |
b | 17.365 ± 0.004 Å |
c | 9.3149 ± 0.0019 Å |
α | 90° |
β | 90° |
γ | 90° |
Cell volume | 2127.4 ± 0.8 Å3 |
Cell temperature | 293 ± 2 K |
Ambient diffraction temperature | 293 ± 2 K |
Number of distinct elements | 5 |
Space group number | 52 |
Hermann-Mauguin space group symbol | P n n a |
Hall space group symbol | -P 2a 2bc |
Residual factor for all reflections | 0.0542 |
Residual factor for significantly intense reflections | 0.0416 |
Weighted residual factors for significantly intense reflections | 0.0938 |
Weighted residual factors for all reflections included in the refinement | 0.0991 |
Goodness-of-fit parameter for all reflections included in the refinement | 1.099 |
Diffraction radiation wavelength | 0.71073 Å |
Diffraction radiation type | MoKα |