Information card for entry 7034834
Formula | C22 H24 Cu Ho N5 O13 |
Calculated formula | C22 H24 Cu Ho N5 O13 |
SMILES | [Ho]123456([O]7[Cu]89[O]1c1c([O]3C)cccc1C=[N]8[C@H]1[C@H]([N]9=Cc3c7c([O]2C)ccc3)CCCC1)([O]=N(=O)O4)([O]=N(=O)O5)[O]=N(O6)=O |
Title of publication | Temperature-controlled polymorphism of chiral Cu(II)-Ln(III) dinuclear complexes exhibiting slow magnetic relaxation. |
Authors of publication | Wen, He-Rui; Bao, Jun; Liu, Sui-Jun; Liu, Cai-Ming; Zhang, Cai-Wei; Tang, Yun-Zhi |
Journal of publication | Dalton transactions (Cambridge, England : 2003) |
Year of publication | 2015 |
Journal volume | 44 |
Journal issue | 24 |
Pages of publication | 11191 - 11201 |
a | 11.2841 ± 0.0002 Å |
b | 15.2285 ± 0.0002 Å |
c | 15.87 ± 0.0002 Å |
α | 90° |
β | 105.007 ± 0.001° |
γ | 90° |
Cell volume | 2634.09 ± 0.07 Å3 |
Cell temperature | 293 ± 2 K |
Ambient diffraction temperature | 293 ± 2 K |
Number of distinct elements | 6 |
Space group number | 4 |
Hermann-Mauguin space group symbol | P 1 21 1 |
Hall space group symbol | P 2yb |
Residual factor for all reflections | 0.0482 |
Residual factor for significantly intense reflections | 0.0336 |
Weighted residual factors for significantly intense reflections | 0.0482 |
Weighted residual factors for all reflections included in the refinement | 0.0517 |
Goodness-of-fit parameter for all reflections included in the refinement | 0.957 |
Diffraction radiation wavelength | 0.71073 Å |
Diffraction radiation type | MoKα |