Information card for entry 7034841
Formula | C8 H26 I5 N5 Pb |
Calculated formula | C8 H26 I5 N5 Pb |
Title of publication | A comparison study of aliphatic and aromatic structure directing agents influencing the crystal and electronic structures, and properties of iodoplumbate hybrids: water induced structure conversion and visible light photocatalytic properties. |
Authors of publication | Liu, Guang-Ning; Shi, Jian-Ru; Han, Xiao-Jiang; Zhang, Xiao; Li, Ke; Li, Jie; Zhang, Tao; Liu, Qi-Sheng; Zhang, Zhen-Wei; Li, Cuncheng |
Journal of publication | Dalton transactions (Cambridge, England : 2003) |
Year of publication | 2015 |
Journal volume | 44 |
Journal issue | 28 |
Pages of publication | 12561 - 12575 |
a | 15.4571 ± 0.0005 Å |
b | 8.8221 ± 0.0004 Å |
c | 16.7663 ± 0.0009 Å |
α | 90° |
β | 92.382 ± 0.004° |
γ | 90° |
Cell volume | 2284.35 ± 0.18 Å3 |
Cell temperature | 293 ± 2 K |
Ambient diffraction temperature | 293 ± 2 K |
Number of distinct elements | 5 |
Space group number | 14 |
Hermann-Mauguin space group symbol | P 1 21/n 1 |
Hall space group symbol | -P 2yn |
Residual factor for all reflections | 0.0319 |
Residual factor for significantly intense reflections | 0.0241 |
Weighted residual factors for significantly intense reflections | 0.0472 |
Weighted residual factors for all reflections included in the refinement | 0.0499 |
Goodness-of-fit parameter for all reflections included in the refinement | 1.02 |
Diffraction radiation wavelength | 0.71073 Å |
Diffraction radiation type | MoKα |