Information card for entry 7034842
Common name | C6 H17 N3 Pb I4 |
Formula | C6 H17 I4 N3 Pb |
Calculated formula | C6 H17 I4 N3 Pb |
Title of publication | A comparison study of aliphatic and aromatic structure directing agents influencing the crystal and electronic structures, and properties of iodoplumbate hybrids: water induced structure conversion and visible light photocatalytic properties. |
Authors of publication | Liu, Guang-Ning; Shi, Jian-Ru; Han, Xiao-Jiang; Zhang, Xiao; Li, Ke; Li, Jie; Zhang, Tao; Liu, Qi-Sheng; Zhang, Zhen-Wei; Li, Cuncheng |
Journal of publication | Dalton transactions (Cambridge, England : 2003) |
Year of publication | 2015 |
Journal volume | 44 |
Journal issue | 28 |
Pages of publication | 12561 - 12575 |
a | 18.2273 ± 0.0007 Å |
b | 8.9569 ± 0.0004 Å |
c | 20.7698 ± 0.0008 Å |
α | 90° |
β | 90° |
γ | 90° |
Cell volume | 3390.9 ± 0.2 Å3 |
Cell temperature | 293 ± 2 K |
Ambient diffraction temperature | 293 ± 2 K |
Number of distinct elements | 5 |
Space group number | 61 |
Hermann-Mauguin space group symbol | P b c a |
Hall space group symbol | -P 2ac 2ab |
Residual factor for all reflections | 0.0673 |
Residual factor for significantly intense reflections | 0.0529 |
Weighted residual factors for significantly intense reflections | 0.1346 |
Weighted residual factors for all reflections included in the refinement | 0.1501 |
Goodness-of-fit parameter for all reflections included in the refinement | 1.003 |
Diffraction radiation wavelength | 0.71073 Å |
Diffraction radiation type | MoKα |