Information card for entry 7034844
Formula | C16 H20 I6 N2 Pb2 |
Calculated formula | C16 H20 I6 N2 Pb2 |
Title of publication | A comparison study of aliphatic and aromatic structure directing agents influencing the crystal and electronic structures, and properties of iodoplumbate hybrids: water induced structure conversion and visible light photocatalytic properties. |
Authors of publication | Liu, Guang-Ning; Shi, Jian-Ru; Han, Xiao-Jiang; Zhang, Xiao; Li, Ke; Li, Jie; Zhang, Tao; Liu, Qi-Sheng; Zhang, Zhen-Wei; Li, Cuncheng |
Journal of publication | Dalton transactions (Cambridge, England : 2003) |
Year of publication | 2015 |
Journal volume | 44 |
Journal issue | 28 |
Pages of publication | 12561 - 12575 |
a | 10.8414 ± 0.0004 Å |
b | 18.2977 ± 0.0006 Å |
c | 7.9777 ± 0.0002 Å |
α | 90° |
β | 106.088 ± 0.004° |
γ | 90° |
Cell volume | 1520.58 ± 0.09 Å3 |
Cell temperature | 293 ± 2 K |
Ambient diffraction temperature | 293 ± 2 K |
Number of distinct elements | 5 |
Space group number | 14 |
Hermann-Mauguin space group symbol | P 1 21/c 1 |
Hall space group symbol | -P 2ybc |
Residual factor for all reflections | 0.0426 |
Residual factor for significantly intense reflections | 0.031 |
Weighted residual factors for significantly intense reflections | 0.0678 |
Weighted residual factors for all reflections included in the refinement | 0.0732 |
Goodness-of-fit parameter for all reflections included in the refinement | 1.003 |
Diffraction radiation wavelength | 0.71073 Å |
Diffraction radiation type | MoKα |