Information card for entry 7034843
Formula | C14 H18 I6 N2 Pb2 |
Calculated formula | C14 H18 I6 N2 Pb2 |
Title of publication | A comparison study of aliphatic and aromatic structure directing agents influencing the crystal and electronic structures, and properties of iodoplumbate hybrids: water induced structure conversion and visible light photocatalytic properties. |
Authors of publication | Liu, Guang-Ning; Shi, Jian-Ru; Han, Xiao-Jiang; Zhang, Xiao; Li, Ke; Li, Jie; Zhang, Tao; Liu, Qi-Sheng; Zhang, Zhen-Wei; Li, Cuncheng |
Journal of publication | Dalton transactions (Cambridge, England : 2003) |
Year of publication | 2015 |
Journal volume | 44 |
Journal issue | 28 |
Pages of publication | 12561 - 12575 |
a | 18.143 ± 0.0006 Å |
b | 15.788 ± 0.0005 Å |
c | 19.2737 ± 0.0008 Å |
α | 90° |
β | 90° |
γ | 90° |
Cell volume | 5520.8 ± 0.3 Å3 |
Cell temperature | 293 ± 2 K |
Ambient diffraction temperature | 293 ± 2 K |
Number of distinct elements | 5 |
Space group number | 61 |
Hermann-Mauguin space group symbol | P b c a |
Hall space group symbol | -P 2ac 2ab |
Residual factor for all reflections | 0.0633 |
Residual factor for significantly intense reflections | 0.0389 |
Weighted residual factors for significantly intense reflections | 0.0773 |
Weighted residual factors for all reflections included in the refinement | 0.0895 |
Goodness-of-fit parameter for all reflections included in the refinement | 0.992 |
Diffraction radiation wavelength | 0.71073 Å |
Diffraction radiation type | MoKα |