Information card for entry 7034848
Formula | C20 H19 N3 O2 Pt |
Calculated formula | C20 H19 N3 O2 Pt |
SMILES | [Pt]12(=C3N(c4ccccc24)C=NN3Cc2ccccc2)OC(=CC(=[O]1)C)C |
Title of publication | C^C* cyclometalated platinum(ii) N-heterocyclic carbene complexes with a sterically demanding β-diketonato ligand - synthesis, characterization and photophysical properties. |
Authors of publication | Tenne, M.; Metz, S.; Wagenblast, G.; Münster, Ingo; Strassner, T. |
Journal of publication | Dalton transactions (Cambridge, England : 2003) |
Year of publication | 2015 |
Journal volume | 44 |
Journal issue | 18 |
Pages of publication | 8444 - 8455 |
a | 11.763 ± 0.0005 Å |
b | 11.875 ± 0.0017 Å |
c | 13.141 ± 0.0019 Å |
α | 90° |
β | 93.774 ± 0.008° |
γ | 90° |
Cell volume | 1831.6 ± 0.4 Å3 |
Cell temperature | 198 ± 2 K |
Ambient diffraction temperature | 198 ± 2 K |
Number of distinct elements | 5 |
Space group number | 14 |
Hermann-Mauguin space group symbol | P 1 21/c 1 |
Hall space group symbol | -P 2ybc |
Residual factor for all reflections | 0.0434 |
Residual factor for significantly intense reflections | 0.0246 |
Weighted residual factors for significantly intense reflections | 0.0329 |
Weighted residual factors for all reflections included in the refinement | 0.0361 |
Goodness-of-fit parameter for all reflections included in the refinement | 1.043 |
Diffraction radiation wavelength | 0.71073 Å |
Diffraction radiation type | MoKα |