Information card for entry 7034849
Formula | C35.5 H37 Au Cl4 P2 Ru |
Calculated formula | C35.5 H37 Au Cl4 P2 Ru |
Title of publication | Design, synthesis and characterisation of new chimeric ruthenium(ii)-gold(i) complexes as improved cytotoxic agents. |
Authors of publication | Massai, Lara; Fernández-Gallardo, Jacob; Guerri, Annalisa; Arcangeli, Annarosa; Pillozzi, Serena; Contel, María; Messori, Luigi |
Journal of publication | Dalton transactions (Cambridge, England : 2003) |
Year of publication | 2015 |
Journal volume | 44 |
Journal issue | 24 |
Pages of publication | 11067 - 11076 |
a | 11.8959 ± 0.0004 Å |
b | 26.8401 ± 0.0006 Å |
c | 13.1736 ± 0.0005 Å |
α | 90° |
β | 113.398 ± 0.004° |
γ | 90° |
Cell volume | 3860.3 ± 0.2 Å3 |
Cell temperature | 293 ± 2 K |
Ambient diffraction temperature | 293 ± 2 K |
Number of distinct elements | 6 |
Space group number | 14 |
Hermann-Mauguin space group symbol | P 1 21/n 1 |
Hall space group symbol | -P 2yn |
Residual factor for all reflections | 0.1257 |
Residual factor for significantly intense reflections | 0.0616 |
Weighted residual factors for significantly intense reflections | 0.1567 |
Weighted residual factors for all reflections included in the refinement | 0.1931 |
Goodness-of-fit parameter for all reflections included in the refinement | 1.031 |
Diffraction radiation wavelength | 0.71069 Å |
Diffraction radiation type | MoKα |